add my signing key for updates

16 jobs for master in 91 minutes and 27 seconds (queued for 1 second)
latest
Status Job ID Name Coverage
  Build
passed #584
target:ar71xx-generic

00:31:46

failed #570
target:ar71xx-nand

00:13:26

failed #571
target:ar71xx-tiny

00:11:05

failed #572
target:brcm2708-bcm2708

00:10:17

failed #573
target:brcm2708-bcm2709

00:13:39

failed #575
target:ipq40xx

00:12:28

failed #574
target:mpc85xx-generic

00:08:54

canceled #576
target:ramips-mt7621

00:02:03

failed #577
target:ramips-mt76x8

00:10:07

failed #580
target:x86-64

00:05:11

failed #578
target:x86-generic

00:11:05

failed #579
target:x86-geode

00:00:53

passed #583
target:ar71xx-generic

00:34:00

canceled #582
target:ar71xx-generic

failed #569
target:ar71xx-generic

00:10:09

 
  Package
skipped #581
package
 
Name Stage Failure
failed
target:ipq40xx Build
make[2]: *** [/builds/nrb/site-ffs/gluon/openwrt/staging_dir/toolchain-arm_cortex-a7+neon-vfpv4_gcc-7.3.0_musl_eabi/stamp/.toolchain_compile] Error 2
make -r world: build failed. Please re-run make with -j1 V=s or V=sc for a higher verbosity level to see what's going on
make[1]: *** [world] Error 1
/builds/nrb/site-ffs/gluon/openwrt/include/toplevel.mk:216: recipe for target 'world' failed
make[1]: Leaving directory '/builds/nrb/site-ffs/gluon/openwrt'
make: *** [all] Error 2
Makefile:150: recipe for target 'all' failed
make: Leaving directory '/builds/nrb/site-ffs/gluon'
ERROR: Job failed: exit code 1
failed
target:ar71xx-nand Build
make[2]: *** [/builds/nrb/site-ffs/gluon/openwrt/staging_dir/toolchain-mips_24kc_gcc-7.3.0_musl/stamp/.toolchain_compile] Error 2
make -r world: build failed. Please re-run make with -j1 V=s or V=sc for a higher verbosity level to see what's going on
make[1]: *** [world] Error 1
/builds/nrb/site-ffs/gluon/openwrt/include/toplevel.mk:216: recipe for target 'world' failed
make[1]: Leaving directory '/builds/nrb/site-ffs/gluon/openwrt'
Makefile:150: recipe for target 'all' failed
make: Leaving directory '/builds/nrb/site-ffs/gluon'
make: *** [all] Error 2
ERROR: Job failed: exit code 1
failed
target:ar71xx-tiny Build
make[2]: *** [/builds/nrb/site-ffs/gluon/openwrt/staging_dir/toolchain-mips_24kc_gcc-7.3.0_musl/stamp/.toolchain_compile] Error 2
make -r world: build failed. Please re-run make with -j1 V=s or V=sc for a higher verbosity level to see what's going on
make[1]: *** [world] Error 1
/builds/nrb/site-ffs/gluon/openwrt/include/toplevel.mk:216: recipe for target 'world' failed
make[1]: Leaving directory '/builds/nrb/site-ffs/gluon/openwrt'
Makefile:150: recipe for target 'all' failed
make: *** [all] Error 2
make: Leaving directory '/builds/nrb/site-ffs/gluon'
ERROR: Job failed: exit code 1
failed
target:x86-64 Build There has been a runner system failure, please try again

  0     0    0     0    0     0      0      0 --:--:-- --:--:-- --:--:--     0
  0     0    0     0    0     0      0      0 --:--:-- --:--:-- --:--:--     0
  0     0    0     0    0     0      0      0 --:--:-- --:--:-- --:--:--     0
100   185  100   185    0     0   2887      0 --:--:-- --:--:-- --:--:--  2936
100 24121 100 24121 0 0 168k 0 --:--:-- --:--:-- --:--:-- 168k
autoreconf: Leaving directory `.'
configure: WARNING: unrecognized options: --enable-mpbsd
autoreconf: Entering directory `.'
autoreconf: configure.ac: not using Gettext
100 145k 100 145k 0 0 300k 0 --:--:-- --:--:-- --:--:-- 300k
100 607 0 607 0 0 1222 0 --:--:-- --:--:-- --:--:-- 1221
0 0 0 0 0 0 0 0 --:--:-- 0:00:04 --:--:-- 0 0 1385k 0 0 0 0 0 0 --:--:-- 0:00:01 --:--:-- 0
ERROR: Job failed (system failure): aborted: terminated
failed
target:x86-geode Build There has been a runner system failure, please try again
From https://github.com/openwrt/packages
* branch openwrt-18.06 -> FETCH_HEAD
--- Updating module 'packages/routing' ---
Initialized empty Git repository in /builds/nrb/site-ffs/gluon/packages/routing/.git/
From https://github.com/openwrt-routing/packages
* branch openwrt-18.06 -> FETCH_HEAD
--- Updating module 'packages/luci' ---
Initialized empty Git repository in /builds/nrb/site-ffs/gluon/packages/luci/.git/
ERROR: Job failed (system failure): aborted: terminated
failed
target:x86-generic Build
make[2]: *** [/builds/nrb/site-ffs/gluon/openwrt/staging_dir/toolchain-i386_pentium4_gcc-7.3.0_musl/stamp/.toolchain_compile] Error 2
make -r world: build failed. Please re-run make with -j1 V=s or V=sc for a higher verbosity level to see what's going on
make[1]: *** [world] Error 1
make: *** [all] Error 2
/builds/nrb/site-ffs/gluon/openwrt/include/toplevel.mk:216: recipe for target 'world' failed
make[1]: Leaving directory '/builds/nrb/site-ffs/gluon/openwrt'
Makefile:150: recipe for target 'all' failed
make: Leaving directory '/builds/nrb/site-ffs/gluon'
ERROR: Job failed: exit code 1
failed
target:ramips-mt76x8 Build
make[2]: *** [/builds/nrb/site-ffs/gluon/openwrt/staging_dir/toolchain-mipsel_24kc_gcc-7.3.0_musl/stamp/.toolchain_compile] Error 2
make -r world: build failed. Please re-run make with -j1 V=s or V=sc for a higher verbosity level to see what's going on
/builds/nrb/site-ffs/gluon/openwrt/include/toplevel.mk:216: recipe for target 'world' failed
make[1]: *** [world] Error 1
make[1]: Leaving directory '/builds/nrb/site-ffs/gluon/openwrt'
Makefile:150: recipe for target 'all' failed
make: Leaving directory '/builds/nrb/site-ffs/gluon'
make: *** [all] Error 2
ERROR: Job failed: exit code 1
failed
target:mpc85xx-generic Build There has been a runner system failure, please try again

  0     0    0     0    0     0      0      0 --:--:-- --:--:-- --:--:--     0
  0     0    0     0    0     0      0      0 --:--:--  0:00:01 --:--:--     0
  0     0    0     0    0     0      0      0 --:--:--  0:00:02 --:--:--     0
  0     0    0     0    0     0      0      0 --:--:--  0:00:03 --:--:--     0
  0     0    0     0    0     0      0      0 --:--:--  0:00:04 --:--:--     0
  0     0    0     0    0     0      0      0 --:--:--  0:00:05 --:--:--     0
  0     0    0     0    0     0      0      0 --:--:--  0:00:06 --:--:--     0
  0     0    0     0    0     0      0      0 --:--:--  0:00:07 --:--:--     0
  0     0    0     0    0     0      0      0 --:--:--  0:00:08 --:--:--     0
  0     0    0     0    0     0      0      0 --:--:--  0:00:09 --:--:--     0
  0     0    0     0    0     0      0      0 --:--:--  0:00:10 --:--:--     0
  0     0    0     0    0     0      0      0 --:--:--  0:00:11 --:--:--     0
  0     0    0     0    0     0      0      0 --:--:--  0:00:12 --:--:--     0
  0     0    0     0    0     0      0      0 --:--:--  0:00:13 --:--:--     0
  0     0    0     0    0     0      0      0 --:--:--  0:00:14 --:--:--     0
  0     0    0     0    0     0      0      0 --:--:--  0:00:15 --:--:--     0
  0     0    0     0    0     0      0      0 --:--:--  0:00:16 --:--:--     0
  0     0    0     0    0     0      0      0 --:--:--  0:00:17 --:--:--     0
  0     0    0     0    0     0      0      0 --:--:--  0:00:18 --:--:--     0
  0     0    0     0    0     0      0      0 --:--:--  0:00:19 --:--:--     0
  0     0    0     0    0     0      0      0 --:--:--  0:00:20 --:--:--     0
Warning: Transient problem: timeout Will retry in 2 seconds. 4 retries left.
0 0 0 0 0 0 0 0 --:--:-- --:--:-- --:--:-- 0 0 0 0 0 0 0 0 0 --:--:-- 0:00:01 --:--:-- 0 0 0 0 0 0 0 0 0 --:--:-- 0:00:02 --:--:-- 0 0 0 0 0 0 0 0 0 --:--:-- 0:00:03 --:--:-- 0 0 0 0 0 0 0 0 0 --:--:-- 0:00:04 --:--:-- 0 0 0 0 0 0 0 0 0 --:--:-- 0:00:05 --:--:-- 0 0 0 0 0 0 0 0 0 --:--:-- 0:00:06 --:--:-- 0 0 0 0 0 0 0 0 0 --:--:-- 0:00:07 --:--:-- 0 0 0 0 0 0 0 0 0 --:--:-- 0:00:08 --:--:-- 0 0 0 0 0 0 0 0 0 --:--:-- 0:00:09 --:--:-- 0 0 0 0 0 0 0 0 0 --:--:-- 0:00:10 --:--:-- 0 0 0 0 0 0 0 0 0 --:--:-- 0:00:11 --:--:-- 0 0 0 0 0 0 0 0 0 --:--:-- 0:00:12 --:--:-- 0 0 0 0 0 0 0 0 0 --:--:-- 0:00:13 --:--:-- 0 0 0 0 0 0 0 0 0 --:--:-- 0:00:14 --:--:-- 0 0 0 0 0 0 0 0 0 --:--:-- 0:00:15 --:--:-- 0 0 0 0 0 0 0 0 0 --:--:-- 0:00:16 --:--:-- 0 0 0 0 0 0 0 0 0 --:--:-- 0:00:17 --:--:-- 0 0 0 0 0 0 0 0 0 --:--:-- 0:00:18 --:--:-- 0 0 0 0 0 0 0 0 0 --:--:-- 0:00:19 --:--:-- 0 0 0 0 0 0 0 0 0 --:--:-- 0:00:20 --:--:-- 0
Warning: Transient problem: timeout Will retry in 4 seconds. 3 retries left.
0 0 0 0 0 0 0 0 --:--:-- --:--:-- --:--:-- 0 0 0 0 0 0 0 0 0 --:--:-- 0:00:01 --:--:-- 0 0 0 0 0 0 0 0 0 --:--:-- 0:00:02 --:--:-- 0 0 0 0 0 0 0 0 0 --:--:-- 0:00:03 --:--:-- 0 0 0 0 0 0 0 0 0 --:--:-- 0:00:04 --:--:-- 0 0 0 0 0 0 0 0 0 --:--:-- 0:00:05 --:--:-- 0 0 0 0 0 0 0 0 0 --:--:-- 0:00:06 --:--:-- 0 0 0 0 0 0 0 0 0 --:--:-- 0:00:07 --:--:-- 0 0 0 0 0 0 0 0 0 --:--:-- 0:00:08 --:--:-- 0 0 0 0 0 0 0 0 0 --:--:-- 0:00:09 --:--:-- 0 0 0 0 0 0 0 0 0 --:--:-- 0:00:10 --:--:-- 0 0 0 0 0 0 0 0 0 --:--:-- 0:00:11 --:--:-- 0 0 0 0 0 0 0 0 0 --:--:-- 0:00:12 --:--:-- 0 0 0 0 0 0 0 0 0 --:--:-- 0:00:13 --:--:-- 0 0 0 0 0 0 0 0 0 --:--:-- 0:00:14 --:--:-- 0 0 0 0 0 0 0 0 0 --:--:-- 0:00:15 --:--:-- 0 0 0 0 0 0 0 0 0 --:--:-- 0:00:15 --:--:-- 0 0 0 0 0 0 0 0 0 --:--:-- 0:00:16 --:--:-- 0 0 0 0 0 0 0 0 0 --:--:-- 0:00:17 --:--:-- 0 0 0 0 0 0 0 0 0 --:--:-- 0:00:18 --:--:-- 0 0 0 0 0 0 0 0 0 --:--:-- 0:00:19 --:--:-- 0 0 0 0 0 0 0 0 0 --:--:-- 0:00:19 --:--:-- 0
Warning: Transient problem: timeout Will retry in 8 seconds. 2 retries left.
0 0 0 0 0 0 0 0 --:--:-- --:--:-- --:--:-- 0 0 0 0 0 0 0 0 0 --:--:-- 0:00:01 --:--:-- 0 0 0 0 0 0 0 0 0 --:--:-- 0:00:02 --:--:-- 0 0 0 0 0 0 0 0 0 --:--:-- 0:00:03 --:--:-- 0 0 0 0 0 0 0 0 0 --:--:-- 0:00:04 --:--:-- 0 0 0 0 0 0 0 0 0 --:--:-- 0:00:05 --:--:-- 0 0 0 0 0 0 0 0 0 --:--:-- 0:00:06 --:--:-- 0 0 0 0 0 0 0 0 0 --:--:-- 0:00:07 --:--:-- 0 0 0 0 0 0 0 0 0 --:--:-- 0:00:08 --:--:-- 0 0 0 0 0 0 0 0 0 --:--:-- 0:00:09 --:--:-- 0 0 0 0 0 0 0 0 0 --:--:-- 0:00:10 --:--:-- 0 0 0 0 0 0 0 0 0 --:--:-- 0:00:11 --:--:-- 0 0 0 0 0 0 0 0 0 --:--:-- 0:00:12 --:--:-- 0 0 0 0 0 0 0 0 0 --:--:-- 0:00:13 --:--:-- 0 0 0 0 0 0 0 0 0 --:--:-- 0:00:14 --:--:-- 0 0 0 0 0 0 0 0 0 --:--:-- 0:00:15 --:--:-- 0 0 0 0 0 0 0 0 0 --:--:-- 0:00:16 --:--:-- 0 0 0 0 0 0 0 0 0 --:--:-- 0:00:17 --:--:-- 0 0 0 0 0 0 0 0 0 --:--:-- 0:00:18 --:--:-- 0 0 0 0 0 0 0 0 0 --:--:-- 0:00:19 --:--:-- 0 0 0 0 0 0 0 0 0 --:--:-- 0:00:20 --:--:-- 0
Warning: Transient problem: timeout Will retry in 16 seconds. 1 retries left.
ERROR: Job failed (system failure): aborted: terminated
failed
target:brcm2708-bcm2709 Build
make[2]: *** [/builds/nrb/site-ffs/gluon/openwrt/staging_dir/toolchain-arm_cortex-a7+neon-vfpv4_gcc-7.3.0_musl_eabi/stamp/.toolchain_compile] Error 2
make -r world: build failed. Please re-run make with -j1 V=s or V=sc for a higher verbosity level to see what's going on
/builds/nrb/site-ffs/gluon/openwrt/include/toplevel.mk:216: recipe for target 'world' failed
make[1]: *** [world] Error 1
make[1]: Leaving directory '/builds/nrb/site-ffs/gluon/openwrt'
make: *** [all] Error 2
Makefile:150: recipe for target 'all' failed
make: Leaving directory '/builds/nrb/site-ffs/gluon'
ERROR: Job failed: exit code 1
failed
target:brcm2708-bcm2708 Build
make[2]: *** [/builds/nrb/site-ffs/gluon/openwrt/staging_dir/toolchain-arm_arm1176jzf-s+vfp_gcc-7.3.0_musl_eabi/stamp/.toolchain_compile] Error 2
make -r world: build failed. Please re-run make with -j1 V=s or V=sc for a higher verbosity level to see what's going on
/builds/nrb/site-ffs/gluon/openwrt/include/toplevel.mk:216: recipe for target 'world' failed
make[1]: Leaving directory '/builds/nrb/site-ffs/gluon/openwrt'
make[1]: *** [world] Error 1
Makefile:150: recipe for target 'all' failed
make: Leaving directory '/builds/nrb/site-ffs/gluon'
make: *** [all] Error 2
ERROR: Job failed: exit code 1